myerrorsandmysolutions.com
coWPAtty – “cc -pipe -Wall -DOPENSSL -O2 -g3 -ggdb -c -o utils.o utils.c utils.c:33:18: error: pcap.h: No such file or directory In file included from utils.c:35: utils.h:29: error: expected ‘)’ before ‘*’ token utils.c:142: error: expected ‘)’ before ‘*’ token make: *** [utils.o] Error 1”
When you try to “make” coWPAtty 4.6 in Ubuntu show following error: cc -pipe -Wall -DOPENSSL -O2 -g3 -ggdb -c -o utils.o utils.c utils.c:33:18: error: pcap.h: No such file or directo…